Reaction Details
TargetNitric oxide synthase, endothelial
LigandBDBM50095172
Substrate/Competitorn/a
Meas. Tech.ChEBML_64987
Ki 460±n/a nM
Citation Lee, YMartásek, PRoman, LJSilverman, RB 1H-pyrazole-1-carboxamidines: new inhibitors of nitric oxide synthase. Bioorg Med Chem Lett10:2771-4 (2000) Nitric oxide synthase, endothelial
Name:Nitric oxide synthase, endothelial
Type:Enzyme
Mol. Mass.:133292.26
Organism:Bos taurus (bovine)
Description:Recombinant eNOS overexpressed in E. coli was used in enzyme assays.
Residue:1205
BDBM50095172
NameBDBM50095172
Synonyms:CHEMBL262040 N-[3-(aminomethyl)phenyl]thiophene-2-carboximidamide
TypeSmall organic molecule
Emp. Form.C12H13N3S
Mol. Mass.231.317
SMILESNCc1cccc(NC(=N)c2cccs2)c1