Reaction Details
TargetCollagenase 3
LigandBDBM11863
Substrate/Competitorn/a
Meas. Tech.ChEBML_106604
IC50 0.600000±n/a nM
Citation Barta, TEBecker, DPBedell, LJDe Crescenzo, GAMcDonald, JJMunie, GERao, SShieh, HSStegeman, RStevens, AMVillamil, CI Synthesis and activity of selective MMP inhibitors with an aryl backbone. Bioorg Med Chem Lett10:2815-7 (2000) Collagenase 3
Name:Collagenase 3
Type:Enzyme
Mol. Mass.:53808.06
Organism:Homo sapiens (Human)
Description:P45452
Residue:471
BDBM11863
NameBDBM11863
Synonyms:4-({[4-(4-chlorophenoxy)benzene]sulfonyl}methyl)-N-hydroxyoxane-4-carboxamide RS 130830 alpha-tetrahydropyran beta-sulfone 1B
TypeSmall organic molecule
Emp. Form.C19H20ClNO6S
Mol. Mass.425.883
SMILESONC(=O)C1(CS(=O)(=O)c2ccc(Oc3ccc(Cl)cc3)cc2)CCOCC1