Reaction Details
TargetCoagulation factor X
LigandBDBM50085509
Substrate/Competitorn/a
Meas. Tech.ChEBML_49331
Ki 12±n/a nM
Citation Galemmo, RAWells, BLRossi, KAAlexander, RSDominguez, CMaduskuie, TPStouten, PFWright, MRAungst, BJWong, PCKnabb, RMWexler, RR The de novo design and synthesis of cyclic urea inhibitors of factor Xa: optimization of the S4 ligand. Bioorg Med Chem Lett10:301-4 (2000) Coagulation factor X
Name:Coagulation factor X
Type:Enzyme
Mol. Mass.:54726.60
Organism:Homo sapiens (Human)
Description:n/a
Residue:488
BDBM50085509
NameBDBM50085509
Synonyms:CHEMBL104995 | Cyclic urea 2,4-diazepin-3-one analogue
TypeSmall organic molecule
Emp. Form.C21H28N5O3S2
Mol. Mass.462.608
SMILESNC(=[NH2+])c1cccc(c1)N1CCCCN(C2CCN(CC2)S(=O)(=O)c2cccs2)C1=O