Reaction Details
TargetSerine protease 1
LigandBDBM50085519
Substrate/Competitorn/a
Meas. Tech.ChEBML_213207
Ki 60±n/a nM
Citation Galemmo, RAWells, BLRossi, KAAlexander, RSDominguez, CMaduskuie, TPStouten, PFWright, MRAungst, BJWong, PCKnabb, RMWexler, RR The de novo design and synthesis of cyclic urea inhibitors of factor Xa: optimization of the S4 ligand. Bioorg Med Chem Lett10:301-4 (2000) Serine protease 1
Name:Serine protease 1
Type:Enzyme
Mol. Mass.:26557.80
Organism:Homo sapiens (Human)
Description:P07477
Residue:247
BDBM50085519
NameBDBM50085519
Synonyms:CHEMBL102502 | Cyclic urea 2,4-diazepin-3-one analogue
TypeSmall organic molecule
Emp. Form.C23H30N5O3S
Mol. Mass.456.58
SMILESNC(=[NH2+])c1cccc(c1)N1CCCCN(C2CCN(CC2)S(=O)(=O)c2ccccc2)C1=O