Reaction Details
TargetCoagulation factor X
LigandBDBM50085523
Substrate/Competitorn/a
Meas. Tech.ChEBML_49331
Ki 12±n/a nM
Citation Galemmo, RAWells, BLRossi, KAAlexander, RSDominguez, CMaduskuie, TPStouten, PFWright, MRAungst, BJWong, PCKnabb, RMWexler, RR The de novo design and synthesis of cyclic urea inhibitors of factor Xa: optimization of the S4 ligand. Bioorg Med Chem Lett10:301-4 (2000) Coagulation factor X
Name:Coagulation factor X
Type:Enzyme
Mol. Mass.:54726.60
Organism:Homo sapiens (Human)
Description:n/a
Residue:488
BDBM50085523
NameBDBM50085523
Synonyms:Cyclic urea 2,4-diazepin-3-one analogue | bis(2,2,2-trifluoroacetate); [amino(3-{2-oxo-3-[1-(pyridin-2-ylmethyl)piperidin-4-yl]-1,3-diazepan-1-yl}phenyl)methylidene]azanium
TypeSmall organic molecule
Emp. Form.C23H31N6O
Mol. Mass.407.5313
SMILESNC(=[NH2+])c1cccc(c1)N1CCCCN(C2CCN(Cc3ccccn3)CC2)C1=O