Reaction Details
TargetAdenosine receptor A1
LigandBDBM50085667
Substrate/Competitorn/a
Meas. Tech.ChEBML_29759
Ki 24±n/a nM
Citation Keeling, SEAlbinson, FDAyres, BEButchers, PRChambers, CLCherry, PCEllis, FEwan, GBGregson, MKnight, JMills, KRavenscroft, PReynolds, LHSanjar, SSheehan, MJ The discovery and synthesis of highly potent, A2a receptor agonists. Bioorg Med Chem Lett10:403-6 (2000) Adenosine receptor A1
Name:Adenosine receptor A1
Type:Protein
Mol. Mass.:36704.13
Organism:Rattus norvegicus (rat)
Description:n/a
Residue:326
BDBM50085667
NameBDBM50085667
Synonyms:(2R,3S,4R,5R)-2-Hydroxymethyl-5-{6-[(naphthalen-1-ylmethyl)-amino]-purin-9-yl}-tetrahydro-furan-3,4-diol | CHEMBL132960
TypeSmall organic molecule
Emp. Form.C21H21N5O4
Mol. Mass.407.4225
SMILESOC[C@H]1O[C@H]([C@H](O)[C@@H]1O)n1cnc2c(NCc3cccc4ccccc34)ncnc12