Reaction Details
TargetDual specificity protein phosphatase 3
LigandBDBM50086645
Substrate/Competitorn/a
Meas. Tech.ChEBML_214525
Ki 1300000±n/a nM
Citation Ibrahimi, OAWu, LZhao, KZhang, ZY Synthesis and characterization of a novel class of protein tyrosine phosphatase inhibitors. Bioorg Med Chem Lett10:457-60 (2000) Dual specificity protein phosphatase 3
Name:Dual specificity protein phosphatase 3
Type:Hydrolase
Mol. Mass.:20480.58
Organism:Homo sapiens (Human)
Description:n/a
Residue:185
BDBM50086645
NameBDBM50086645
Synonyms:[4-(4-hydroxybenzyl)phenoxy]methylphosphonate
TypeSmall organic molecule
Emp. Form.C14H13O5P
Mol. Mass.292.2249
SMILESOc1ccc(Cc2ccc(OCP([O-])([O-])=O)cc2)cc1