Reaction Details
TargetKappa-type opioid receptor
LigandBDBM50086682
Substrate/Competitorn/a
Meas. Tech.ChEMBL_145386 (CHEMBL750076)
Ki 5500±n/a nM
Citation King, CHMeckler, HHerr, RJTrova, MPGlick, SDMaisonneuve, IM Synthesis of enantiomerically pure (+)- and (-)-18-methoxycoronaridine hydrochloride and their preliminary assessment as anti-addictive agents. Bioorg Med Chem Lett10:473-6 (2000) Kappa-type opioid receptor
Name:Kappa-type opioid receptor
Type:G Protein-Coupled Receptor (GPCR)
Mol. Mass.:42648.76
Organism:Homo sapiens (Human)
Description:P41145
Residue:380
BDBM50086682
NameBDBM50086682
Synonyms:(+)-18-Methoxycoronaridine hydrochloride (-)-18-Methoxycoronaridine hydrochloride | CHEMBL554230
TypeSmall organic molecule
Emp. Form.C22H28N2O3
Mol. Mass.368.4693
SMILESCOCCC1CC2CN3CCc4c([nH]c5ccccc45)C(C2)(C13)C(=O)OC