Reaction Details
TargetAlpha-2A adrenergic receptor
LigandBDBM50087148
Substrate/Competitorn/a
Meas. Tech.ChEBML_33064
Ki 1.3±n/a nM
Citation Zheng, WLei, LLalchandani, SSun, GFeller, DRMiller, DD Yohimbine dimers exhibiting binding selectivities for human alpha2a- versus alpha2b-adrenergic receptors. Bioorg Med Chem Lett10:627-30 (2000) Alpha-2A adrenergic receptor
Name:Alpha-2A adrenergic receptor
Type:Enzyme
Mol. Mass.:48979.91
Organism:Homo sapiens (Human)
Description:P08913
Residue:450
BDBM50087148
NameBDBM50087148
Synonyms:1N-{9-[2-hydroxy-(1R,2S,4aR,13bS,14aS)-1,2,3,4,4a,5,7,8,13,13b,14,14a-dodecahydroisoquino[3,2-a]b-carbolin-1-ylcarboxamido]nonyl}-2-hydroxy-(1R,2S,4aR,13bS,14aS)-1,2,3,4,4a,5,7,8,13,13b,14,14a-dodecahydroisoquino[3,2 ;dihydrochloride | CHEMBL539606
TypeSmall organic molecule
Emp. Form.C49H66N6O4
Mol. Mass.803.0861
SMILESO[C@H]1CC[C@H]2CN3CCc4c([nH]c5ccccc45)[C@@H]3C[C@@H]2[C@H]1C(=O)NCCCCCCCCCNC(=O)[C@H]1[C@@H](O)CC[C@H]2CN3CCc4c([nH]c5ccccc45)[C@@H]3C[C@H]12