Reaction Details
TargetKappa-type opioid receptor
LigandBDBM50087697
Substrate/Competitorn/a
Meas. Tech.ChEBML_145705
Ki 0.820000±n/a nM
Citation Röver, SWichmann, JJenck, FAdam, GCesura, AM ORL1 receptor ligands: structure-activity relationships of 8-cycloalkyl-1-phenyl-1,3,8-triaza-spiro[4.5]decan-4-ones. Bioorg Med Chem Lett10:831-4 (2000) Kappa-type opioid receptor
Name:Kappa-type opioid receptor
Type:G Protein-Coupled Receptor (GPCR)
Mol. Mass.:42692.90
Organism:Rattus norvegicus (rat)
Description:P34975
Residue:380
BDBM50087697
NameBDBM50087697
Synonyms:8-Cycloundecyl-1-phenyl-1,3,8-triaza-spiro[4.5]decan-4-one | CHEMBL354545
TypeSmall organic molecule
Emp. Form.C24H37N3O
Mol. Mass.383.5701
SMILESO=C1NCN(c2ccccc2)C11CCN(CC1)C1CCCCCCCCCC1