Reaction Details
TargetKappa-type opioid receptor
LigandBDBM50087687
Substrate/Competitorn/a
Meas. Tech.ChEBML_145705
Ki 3.9±n/a nM
Citation Röver, SWichmann, JJenck, FAdam, GCesura, AM ORL1 receptor ligands: structure-activity relationships of 8-cycloalkyl-1-phenyl-1,3,8-triaza-spiro[4.5]decan-4-ones. Bioorg Med Chem Lett10:831-4 (2000) Kappa-type opioid receptor
Name:Kappa-type opioid receptor
Type:G Protein-Coupled Receptor (GPCR)
Mol. Mass.:42692.90
Organism:Rattus norvegicus (rat)
Description:P34975
Residue:380
BDBM50087687
NameBDBM50087687
Synonyms:8-Cyclononyl-1-phenyl-1,3,8-triaza-spiro[4.5]decan-4-one | CHEMBL440928
TypeSmall organic molecule
Emp. Form.C22H33N3O
Mol. Mass.355.5169
SMILESO=C1NCN(c2ccccc2)C11CCN(CC1)C1CCCCCCCC1