Reaction Details
TargetNociceptin receptor
LigandBDBM50087693
Substrate/Competitorn/a
Meas. Tech.ChEBML_146124
Ki 2±n/a nM
Citation Röver, SWichmann, JJenck, FAdam, GCesura, AM ORL1 receptor ligands: structure-activity relationships of 8-cycloalkyl-1-phenyl-1,3,8-triaza-spiro[4.5]decan-4-ones. Bioorg Med Chem Lett10:831-4 (2000) Nociceptin receptor
Name:Nociceptin receptor
Type:Enzyme Catalytic Domain
Mol. Mass.:40531.08
Organism:RAT
Description:Nociceptin/Orphanin FQ, NOP receptor 0 RAT::P35370
Residue:367
BDBM50087693
NameBDBM50087693
Synonyms:1-Phenyl-8-(4-propyl-cyclohexyl)-1,3,8-triaza-spiro[4.5]decan-4-one | CHEMBL166445
TypeSmall organic molecule
Emp. Form.C22H33N3O
Mol. Mass.355.5169
SMILESCCC[C@H]1CC[C@H](CC1)N1CCC2(CC1)N(CNC2=O)c1ccccc1