Reaction Details
Target1,3-beta-glucan synthase
LigandBDBM50100335
Substrate/Competitorn/a
Meas. Tech.ChEBML_39039
IC50 0.200000±n/a nM
Citation Masubuchi, KOkada, TKohchi, MMurata, TTsukazaki, MKondoh, OYamazaki, TSatoh, YOno, YTsukaguchi, TKobayashi, KOno, NInoue, THorii, IShimma, N Synthesis and antifungal activities of novel 1,3-beta-D-glucan synthase inhibitors. Part 2. Bioorg Med Chem Lett11:1273-6 (2001) 1,3-beta-glucan synthase
Name:1,3-beta-glucan synthase
Type:Enzyme
Mol. Mass.:218006.59
Organism:Candida albicans (Yeast)
Description:O13428
Residue:1897
BDBM50100335
NameBDBM50100335
Synonyms:CHEMBL2371681 | RO-09-3655 derivative
TypeSmall organic molecule
Emp. Form.C82H141N19O24
Mol. Mass.1777.1098
SMILES[H][C@@]12C[C@@H](O)CN1C(=O)[C@@H](NC(=O)[C@H](Cc1ccc(O)cc1)NC(=O)[C@@H](C)NC(=O)[C@@]([H])(NC(=O)C[C@@H](CCCCCCCCCCCCC)OC(=O)[C@H](CCCN(CCN)C(=O)[C@H](CCCN)N(CCN)CCN)NC(=O)[C@@]([H])(NC(=O)CNC(=O)[C@@]([H])(NC(=O)[C@]1([H])[C@@H](O)CCN1C(=O)[C@@]([H])(NC(=O)[C@@]([H])(NC2=O)[C@@H](C)O)[C@@H](C)O)[C@H](O)CC(N)=O)[C@@H](C)O)[C@@H](C)O)C(C)C