Reaction Details
TargetE-selectin
LigandBDBM50100960
Substrate/Competitorn/a
Meas. Tech.ChEBML_61023
IC50 500000±n/a nM
Citation Bradley, SJFazli, AKiefel, MJvon Itzstein, M Synthesis of novel sialylmimetics as biological probes. Bioorg Med Chem Lett11:1587-90 (2001) E-selectin
Name:E-selectin
Type:PROTEIN
Mol. Mass.:66642.96
Organism:Homo sapiens (Human)
Description:ChEMBL_1438995
Residue:610
BDBM50100960
NameBDBM50100960
Synonyms:BDBM50214411 {3,5-Dihydroxy-2-hydroxymethyl-6-[(1R,2R)-2-(3,4,5-trihydroxy-6-methyl-tetrahydro-pyran-2-yloxy)-cyclohexyloxy]-tetrahydro-pyran-4-yloxy}-acetic acid anion
TypeSmall organic molecule
Emp. Form.C20H34O13
Mol. Mass.482.4762
SMILESC[C@@H]1O[C@@H](O[C@@H]2CCCC[C@H]2O[C@@H]2O[C@@H](CO)[C@H](O)[C@H](OCC(O)=O)[C@@H]2O)[C@@H](O)[C@@H](O)[C@@H]1O