Reaction Details
TargetMu-type opioid receptor
LigandBDBM50128411
Substrate/Competitorn/a
Meas. Tech.ChEBML_145276
Ki 1.9±n/a nM
Citation Wentland, MPLou, RDehnhardt, CMDuan, WCohen, DJBidlack, JM 3-Carboxamido analogues of morphine and naltrexone. synthesis and opioid receptor binding properties. Bioorg Med Chem Lett11:1717-21 (2001) Mu-type opioid receptor
Name:Mu-type opioid receptor
Type:Enzyme Catalytic Domain
Mol. Mass.:11165.58
Organism:GUINEA PIG
Description:P97266
Residue:98
BDBM50128411
NameBDBM50128411
Synonyms:3-desoxy-3-carboxamidonaltrexone CHEMBL56695
TypeSmall organic molecule
Emp. Form.C21H24N2O4
Mol. Mass.368.4263
SMILESNC(=O)c1ccc2C[C@H]3N(CC4CC4)CC[C@@]45[C@@H](Oc1c24)C(=O)CC[C@@]35O