Reaction Details
TargetCarbonic anhydrase 2
LigandBDBM50101343
Substrate/Competitorn/a
Meas. Tech.ChEBML_45058
Ki 85±n/a nM
Citation Mincione, FStarnotti, MMenabuoni, LScozzafava, ACasini, ASupuran, CT Carbonic anhydrase inhibitors: 4-sulfamoyl-benzenecarboxamides and 4-chloro-3-sulfamoyl-benzenecarboxamides with strong topical antiglaucoma properties. Bioorg Med Chem Lett11:1787-91 (2001) Carbonic anhydrase 2
Name:Carbonic anhydrase 2
Type:Enzyme
Mol. Mass.:29250.71
Organism:Homo sapiens (Human)
Description:P00918
Residue:260
BDBM50101343
NameBDBM50101343
Synonyms:(4-Sulfamoyl-benzoylamino)-acetic acid | CHEMBL51385
TypeSmall organic molecule
Emp. Form.C9H10N2O5S
Mol. Mass.258.251
SMILESNS(=O)(=O)c1ccc(cc1)C(=O)NCC(O)=O