Reaction Details
TargetEstrogen receptor beta
LigandBDBM50101979
Substrate/Competitorn/a
Meas. Tech.ChEMBL_67821 (CHEMBL677051)
IC50 2400±n/a nM
Citation Matsuda, HShimoda, HMorikawa, TYoshikawa, M Phytoestrogens from the roots of Polygonum cuspidatum (Polygonaceae): structure-requirement of hydroxyanthraquinones for estrogenic activity. Bioorg Med Chem Lett11:1839-42 (2001) Estrogen receptor beta
Name:Estrogen receptor beta
Type:Protein
Mol. Mass.:59238.43
Organism:Homo sapiens (Human)
Description:Q92731
Residue:530
BDBM50101979
NameBDBM50101979
Synonyms:2,6-Dihydroxyanthraquinone 2,6-dihydroxy-9,10-anthraquinone 2,6-dihydroxyanthracene-9,10-dione CHEMBL298398 anthraflavin
TypeSmall organic molecule
Emp. Form.C14H8O4
Mol. Mass.240.2109
SMILESOc1ccc2C(=O)c3cc(O)ccc3C(=O)c2c1