Reaction Details
TargetEstrogen receptor beta
LigandBDBM50366683
Substrate/Competitorn/a
Meas. Tech.ChEMBL_67821 (CHEMBL677051)
IC50 62000±n/a nM
Citation Matsuda, HShimoda, HMorikawa, TYoshikawa, M Phytoestrogens from the roots of Polygonum cuspidatum (Polygonaceae): structure-requirement of hydroxyanthraquinones for estrogenic activity. Bioorg Med Chem Lett11:1839-42 (2001) Estrogen receptor beta
Name:Estrogen receptor beta
Type:Protein
Mol. Mass.:59238.43
Organism:Homo sapiens (Human)
Description:Q92731
Residue:530
BDBM50366683
NameBDBM50366683
Synonyms:CHEMBL464360
TypeSmall organic molecule
Emp. Form.C21H20O10
Mol. Mass.432.3775
SMILESCc1cc(O)c2C(=O)c3c(O[C@@H]4O[C@H](CO)[C@@H](O)[C@H](O)[C@H]4O)cc(O)cc3C(=O)c2c1