Reaction Details
TargetMetabotropic glutamate receptor 2
LigandBDBM50030627
Substrate/Competitorn/a
Meas. Tech.ChEMBL_106209 (CHEMBL713198)
IC50 290000±n/a nM
Citation Mukhopadhyaya, JKKozikowski, APGrajkowska, EPshenichkin, SWroblewski, JT Synthesis of N(1)-substituted analogues of (2R,4R)-4-amino-pyrrolidine-2,4-dicarboxylic acid as agonists, partial agonists, and antagonists of group II metabotropic glutamate receptors. Bioorg Med Chem Lett11:1919-24 (2001) Metabotropic glutamate receptor 2
Name:Metabotropic glutamate receptor 2
Type:PROTEIN
Mol. Mass.:95786.41
Organism:Rattus norvegicus
Description:ChEMBL_105034
Residue:872
BDBM50030627
NameBDBM50030627
Synonyms:(+-)-MCPG 4-(1-Amino-1-carboxy-ethyl)-benzoic acid CHEMBL299683 | MCPG
TypeSmall organic molecule
Emp. Form.C10H11NO4
Mol. Mass.209.1986
SMILESCC(N)(C(O)=O)c1ccc(cc1)C(O)=O