Reaction Details
TargetGrowth hormone secretagogue receptor type 1
LigandBDBM50366689
Substrate/Competitorn/a
Meas. Tech.ChEMBL_72513 (CHEMBL685178)
IC50 0.250000±n/a nM
Citation Palucki, BLFeighner, SDPong, SMcKee, KKHreniuk, DLTan, CHoward, ADVan der Ploeg, LHPatchett, AANargund, RP Spiro(indoline-3,4'-piperidine) growth hormone secretagogues as ghrelin mimetics. Bioorg Med Chem Lett11:1955-7 (2001) Growth hormone secretagogue receptor type 1
Name:Growth hormone secretagogue receptor type 1
Type:Receptor
Mol. Mass.:41334.57
Organism:Homo sapiens (Human)
Description:Receptor binding studies use plasma membranes from LLC PK-1 cells transiently transfected with hGHSR1a.
Residue:366
BDBM50366689
NameBDBM50366689
Synonyms:GHRELIN
TypeSmall organic molecule
Emp. Form.C147H245N45O42
Mol. Mass.3314.7945
SMILESCCCCCCCC(=O)OC[C@H](NC(=O)CNC(=O)[C@@H](N)CCCN=C(N)N)C(=O)N[C@@H](CO)C(=O)N[C@@H](Cc1ccccc1)C(=O)N[C@@H](CC(C)C)C(=O)N[C@@H](CO)C(=O)N1CCC[C@H]1C(=O)N[C@@H](CCC(O)=O)C(=O)N[C@@H](Cc1cnc[nH]1)C(=O)N[C@@H](CCC(N)=O)C(=O)N[C@@H](CCCCN)C(=O)N[C@@H](C)C(=O)N[C@@H](CCC(N)=O)C(=O)N[C@@H](CCC(N)=O)C(=O)N[C@@H](CCCN=C(N)N)C(=O)N[C@@H](CCCCN)C(=O)N[C@@H](CCC(O)=O)C(=O)N[C@@H](CO)C(=O)N[C@@H](CCCCN)C(=O)N[C@@H](CCCCN)C(=O)N1CCC[C@H]1C(=O)N1CCC[C@H]1C(=O)N[C@@H](C)C(=O)N[C@@H](CCCCN)C(=O)N[C@@H](CC(C)C)C(=O)N[C@@H](CCC(N)=O)C(=O)N1CCC[C@H]1C(O)=O