Reaction Details
TargetGrowth hormone secretagogue receptor type 1
LigandBDBM50102235
Substrate/Competitorn/a
Meas. Tech.ChEMBL_72513 (CHEMBL685178)
IC50 829±n/a nM
Citation Palucki, BLFeighner, SDPong, SMcKee, KKHreniuk, DLTan, CHoward, ADVan der Ploeg, LHPatchett, AANargund, RP Spiro(indoline-3,4'-piperidine) growth hormone secretagogues as ghrelin mimetics. Bioorg Med Chem Lett11:1955-7 (2001) Growth hormone secretagogue receptor type 1
Name:Growth hormone secretagogue receptor type 1
Type:Receptor
Mol. Mass.:41334.57
Organism:Homo sapiens (Human)
Description:Receptor binding studies use plasma membranes from LLC PK-1 cells transiently transfected with hGHSR1a.
Residue:366
BDBM50102235
NameBDBM50102235
Synonyms:2-[1-amino-2-hydroxy-(1S)-ethylcarboxamido]-3-[1-methylsulfonylspiro[2,3-dihydro-1H-indole-3,4'-(hexahydropyridine)]-1-yl]-3-oxo-(2R)-propyl octanoate; Trifluoroacetate | CHEMBL291333
TypeSmall organic molecule
Emp. Form.C27H42N4O7S
Mol. Mass.566.71
SMILESCCCCCCCC(=O)OC[C@@H](NC(=O)[C@@H](N)CO)C(=O)N1CCC2(CN(c3ccccc23)S(C)(=O)=O)CC1