Reaction Details
TargetBone morphogenetic protein 1
LigandBDBM50102988
Substrate/Competitorn/a
Meas. Tech.ChEBML_158894
IC50 9±n/a nM
Citation Dankwardt, SMMartin, RLChan, CSVan Wart, HEWalker, KADelaet, NGRobinson, LA Amino acid derived sulfonamide hydroxamates as inhibitors of procollagen C-proteinase: solid-phase synthesis of ornithine analogues. Bioorg Med Chem Lett11:2085-8 (2001) Bone morphogenetic protein 1
Name:Bone morphogenetic protein 1
Type:PROTEIN
Mol. Mass.:111254.03
Organism:Homo sapiens (Human)
Description:ChEMBL_518962
Residue:986
BDBM50102988
NameBDBM50102988
Synonyms:CHEMBL21486 | {(R)-4-[Benzo[1,3]dioxol-5-ylmethyl-(4-methoxy-benzenesulfonyl)-amino]-4-hydroxycarbamoyl-butyl}-carbamic acid benzyl ester
TypeSmall organic molecule
Emp. Form.C28H31N3O9S
Mol. Mass.585.625
SMILESCOc1ccc(cc1)S(=O)(=O)N(Cc1ccc2OCOc2c1)[C@H](CCCNC(=O)OCc1ccccc1)C(=O)NO