Reaction Details
TargetCollagenase 3
LigandBDBM50103161
Substrate/Competitorn/a
Meas. Tech.ChEBML_106636
IC50 1±n/a nM
Citation Levin, JIChen, JDu, MHogan, MKincaid, SNelson, FCVenkatesan, AMWehr, TZask, ADiJoseph, JKillar, LMSkala, SSung, ASharr, MRoth, CJin, GCowling, RMohler, KMBlack, RAMarch, CJSkotnicki, JS The discovery of anthranilic acid-based MMP inhibitors. Part 2: SAR of the 5-position and P1(1) groups. Bioorg Med Chem Lett11:2189-92 (2001) Collagenase 3
Name:Collagenase 3
Type:Enzyme
Mol. Mass.:53808.06
Organism:Homo sapiens (Human)
Description:P45452
Residue:471
BDBM50103161
NameBDBM50103161
Synonyms:3-Furan-2-yl-N-hydroxy-2-[(4-methoxy-benzenesulfonyl)-pyridin-3-ylmethyl-amino]-5-methyl-benzamide | CHEMBL69268
TypeSmall organic molecule
Emp. Form.C25H23N3O6S
Mol. Mass.493.532
SMILESCOc1ccc(cc1)S(=O)(=O)N(Cc1cccnc1)c1c(cc(C)cc1-c1ccco1)C(=O)NO