Reaction Details
Target3-oxo-5-alpha-steroid 4-dehydrogenase 1
LigandBDBM50103876
Substrate/Competitorn/a
Meas. Tech.ChEMBL_205216 (CHEMBL816490)
IC50 1300±n/a nM
Citation Fan, GMar, WPark, MKChoi, EWKim, KKim, S A novel class of inhibitors for steroid 5alpha-reductase: synthesis and evaluation of umbelliferone derivatives. Bioorg Med Chem Lett11:2361-3 (2001) 3-oxo-5-alpha-steroid 4-dehydrogenase 1
Name:3-oxo-5-alpha-steroid 4-dehydrogenase 1
Type:Enzyme
Mol. Mass.:29472.80
Organism:Homo sapiens (Human)
Description:P18405
Residue:259
BDBM50103876
NameBDBM50103876
Synonyms:7-(1,1-Dimethyl-allyloxy)-chromen-2-one | CHEMBL311624
TypeSmall organic molecule
Emp. Form.C14H14O3
Mol. Mass.230.2592
SMILESCC(C)(Oc1ccc2ccc(=O)oc2c1)C=C