Reaction Details
Target3-oxo-5-alpha-steroid 4-dehydrogenase 1
LigandBDBM50174558
Substrate/Competitorn/a
Meas. Tech.ChEMBL_205216 (CHEMBL816490)
IC50>123000±n/a nM
Citation Fan, GMar, WPark, MKChoi, EWKim, KKim, S A novel class of inhibitors for steroid 5alpha-reductase: synthesis and evaluation of umbelliferone derivatives. Bioorg Med Chem Lett11:2361-3 (2001) 3-oxo-5-alpha-steroid 4-dehydrogenase 1
Name:3-oxo-5-alpha-steroid 4-dehydrogenase 1
Type:Enzyme
Mol. Mass.:29472.80
Organism:Homo sapiens (Human)
Description:P18405
Residue:259
BDBM50174558
NameBDBM50174558
Synonyms:7-hydroxy-2H-1-benzopyran-2-one CHEMBL51628 beta-umbelliferone skimmetin | umbelliferone
TypeSmall organic molecule
Emp. Form.C9H6O3
Mol. Mass.162.1421
SMILESOc1ccc2ccc(=O)oc2c1