Reaction Details
Target3-oxo-5-alpha-steroid 4-dehydrogenase 1
LigandBDBM50103875
Substrate/Competitorn/a
Meas. Tech.ChEBML_205216
IC50 50300±n/a nM
Citation Fan, GMar, WPark, MKChoi, EWKim, KKim, S A novel class of inhibitors for steroid 5alpha-reductase: synthesis and evaluation of umbelliferone derivatives. Bioorg Med Chem Lett11:2361-3 (2001) 3-oxo-5-alpha-steroid 4-dehydrogenase 1
Name:3-oxo-5-alpha-steroid 4-dehydrogenase 1
Type:Enzyme
Mol. Mass.:29472.80
Organism:Homo sapiens (Human)
Description:P18405
Residue:259
BDBM50103875
NameBDBM50103875
Synonyms:8-Allyl-7-(1,1-dimethyl-allyloxy)-chromen-2-one | CHEMBL311013
TypeSmall organic molecule
Emp. Form.C17H18O3
Mol. Mass.270.323
SMILESCC(C)(Oc1ccc2ccc(=O)oc2c1CC=C)C=C