Reaction Details
Target3-oxo-5-alpha-steroid 4-dehydrogenase 1
LigandBDBM50103877
Substrate/Competitorn/a
Meas. Tech.ChEBML_205216
IC50 8400±n/a nM
Citation Fan, GMar, WPark, MKChoi, EWKim, KKim, S A novel class of inhibitors for steroid 5alpha-reductase: synthesis and evaluation of umbelliferone derivatives. Bioorg Med Chem Lett11:2361-3 (2001) 3-oxo-5-alpha-steroid 4-dehydrogenase 1
Name:3-oxo-5-alpha-steroid 4-dehydrogenase 1
Type:Enzyme
Mol. Mass.:29472.80
Organism:Homo sapiens (Human)
Description:P18405
Residue:259
BDBM50103877
NameBDBM50103877
Synonyms:6-Allyl-7-hydroxy-chromen-2-one | CHEMBL76373
TypeSmall organic molecule
Emp. Form.C12H10O3
Mol. Mass.202.206
SMILESOc1cc2oc(=O)ccc2cc1CC=C