Reaction Details
Target3-oxo-5-alpha-steroid 4-dehydrogenase 1
LigandBDBM50103880
Substrate/Competitorn/a
Meas. Tech.ChEBML_205216
IC50 490±n/a nM
Citation Fan, GMar, WPark, MKChoi, EWKim, KKim, S A novel class of inhibitors for steroid 5alpha-reductase: synthesis and evaluation of umbelliferone derivatives. Bioorg Med Chem Lett11:2361-3 (2001) 3-oxo-5-alpha-steroid 4-dehydrogenase 1
Name:3-oxo-5-alpha-steroid 4-dehydrogenase 1
Type:Enzyme
Mol. Mass.:29472.80
Organism:Homo sapiens (Human)
Description:P18405
Residue:259
BDBM50103880
NameBDBM50103880
Synonyms:Benzoic acid 8-allyl-2-oxo-2H-chromen-7-yl ester | CHEMBL76959
TypeSmall organic molecule
Emp. Form.C19H14O4
Mol. Mass.306.3121
SMILESC=CCc1c(OC(=O)c2ccccc2)ccc2ccc(=O)oc12