Reaction Details
TargetBeta-glucosidase A
LigandBDBM50402977
Substrate/Competitorn/a
Meas. Tech.ChEMBL_37440 (CHEMBL648536)
Ki 19000±n/a nM
Citation Popowycz, FGerber-Lemaire, SDemange, RRodriguez-García, EAsenjo, ATRobina, IVogel, P Derivatives of (2R,3R,4S)-2-aminomethylpyrrolidine-3,4-diol are selective alpha-mannosidase inhibitors. Bioorg Med Chem Lett11:2489-93 (2001) Beta-glucosidase A
Name:Beta-glucosidase A
Type:PROTEIN
Mol. Mass.:53484.21
Organism:Caldocellum saccharolyticum
Description:ChEMBL_37437
Residue:455
BDBM50402977
NameBDBM50402977
Synonyms:CHEMBL2207397
TypeSmall organic molecule
Emp. Form.C6H13NO4
Mol. Mass.163.1717
SMILESOCC(O)[C@H]1NC[C@H](O)[C@@H]1O