Reaction Details
TargetBeta-glucosidase A
LigandBDBM50104302
Substrate/Competitorn/a
Meas. Tech.ChEMBL_37440 (CHEMBL648536)
Ki 120000±n/a nM
Citation Popowycz, FGerber-Lemaire, SDemange, RRodriguez-García, EAsenjo, ATRobina, IVogel, P Derivatives of (2R,3R,4S)-2-aminomethylpyrrolidine-3,4-diol are selective alpha-mannosidase inhibitors. Bioorg Med Chem Lett11:2489-93 (2001) Beta-glucosidase A
Name:Beta-glucosidase A
Type:PROTEIN
Mol. Mass.:53484.21
Organism:Caldocellum saccharolyticum
Description:ChEMBL_37437
Residue:455
BDBM50104302
NameBDBM50104302
Synonyms:2-{[(1-Benzyl-piperidin-4-ylmethyl)-amino]-methyl}-pyrrolidine-3,4-diol | CHEMBL84272
TypeSmall organic molecule
Emp. Form.C18H29N3O2
Mol. Mass.319.4418
SMILESOC1CNC(CNCC2CCN(Cc3ccccc3)CC2)C1O