Reaction Details
TargetAcetylcholinesterase
LigandBDBM50104603
Substrate/Competitorn/a
Meas. Tech.ChEBML_27387
Ki 12300±n/a nM
Citation Högenauer, KBaumann, KEnz, AMulzer, J Synthesis and acetylcholinesterase inhibition of 5-desamino huperzine A derivatives. Bioorg Med Chem Lett11:2627-30 (2001) Acetylcholinesterase
Name:Acetylcholinesterase
Type:Enzyme
Mol. Mass.:68193.62
Organism:Rattus norvegicus (rat)
Description:P37136
Residue:614
BDBM50104603
NameBDBM50104603
Synonyms:13-Eth-(Z)-ylidene-11-methyl-6-aza-tricyclo[7.3.1.0*2,7*]trideca-2(7),3,10-trien-5-one | CHEMBL88140
TypeSmall organic molecule
Emp. Form.C15H17NO
Mol. Mass.227.3016
SMILESC\C=C1\C2Cc3[nH]c(=O)ccc3C1CC(C)=C2