Reaction Details
TargetHistone deacetylase
LigandBDBM50238632
Substrate/Competitorn/a
Meas. Tech.ChEBML_79059
Ki 8±n/a nM
Citation Colletti, SLMyers, RWDarkin-Rattray, SJGurnett, AMDulski, PMGaluska, SAllocco, JJAyer, MBLi, CLim, JCrumley, TMCannova, CSchmatz, DMWyvratt, MJFisher, MHMeinke, PT Broad spectrum antiprotozoal agents that inhibit histone deacetylase: structure-activity relationships of apicidin. Part 2. Bioorg Med Chem Lett11:113-7 (2001) Histone deacetylase
Name:Histone deacetylase
Synonyms:n/a
Type:PROTEIN
Mol. Mass.:48692.87
Organism:Cryptosporidium parvum
Description:ChEMBL_87390
Residue:432
BDBM50238632
NameBDBM50238632
TypeSmall organic molecule
Emp. Form.C34H49N5O6
Mol. Mass.623.7828
SMILESCC[C@H](C)[C@@H]1NC(=O)[C@H](Cc2cn(OC)c3ccccc23)NC(=O)[C@H](CCCCCC(=O)CC)NC(=O)[C@H]2CCCCN2C1=O