Reaction Details
TargetHistone deacetylase
LigandBDBM50366736
Substrate/Competitorn/a
Meas. Tech.ChEBML_79059
Ki 70±n/a nM
Citation Colletti, SLMyers, RWDarkin-Rattray, SJGurnett, AMDulski, PMGaluska, SAllocco, JJAyer, MBLi, CLim, JCrumley, TMCannova, CSchmatz, DMWyvratt, MJFisher, MHMeinke, PT Broad spectrum antiprotozoal agents that inhibit histone deacetylase: structure-activity relationships of apicidin. Part 2. Bioorg Med Chem Lett11:113-7 (2001) Histone deacetylase
Name:Histone deacetylase
Synonyms:n/a
Type:PROTEIN
Mol. Mass.:48692.87
Organism:Cryptosporidium parvum
Description:ChEMBL_87390
Residue:432
BDBM50366736
NameBDBM50366736
Synonyms:CHEMBL1793972
TypeSmall organic molecule
Emp. Form.C35H49N5O6
Mol. Mass.635.7935
SMILESCC[C@H](C)[C@@H]1NC(=O)[C@@H](NC(=O)[C@H](CCCCCC(=O)CC)NC(=O)[C@H]2CCCCN2C1=O)c1cn(CC)c2ccccc2c1=O