Reaction Details
TargetP2Y purinoceptor 4
LigandBDBM50118213
Substrate/Competitorn/a
Meas. Tech.ChEBML_86461
EC50 100±n/a nM
Citation Pendergast, WYerxa, BRDouglass, JGShaver, SRDougherty, RWRedick, CCSims, IFRideout, JL Synthesis and P2Y receptor activity of a series of uridine dinucleoside 5'-polyphosphates. Bioorg Med Chem Lett11:157-60 (2001) P2Y purinoceptor 4
Name:P2Y purinoceptor 4
Type:PROTEIN
Mol. Mass.:40977.17
Organism:Homo sapiens (Human)
Description:ChEMBL_751027
Residue:365
BDBM50118213
NameBDBM50118213
Synonyms:5'-UTP H4utp uridine 5'-(tetrahydrogen triphosphate) | uridine 5'-triphosphoric acid
TypeSmall organic molecule
Emp. Form.C9H15N2O15P3
Mol. Mass.484.1411
SMILESO[C@@H]1[C@@H](COP(O)(=O)OP(O)(=O)OP(O)(O)=O)O[C@H]([C@@H]1O)n1ccc(=O)[nH]c1=O