Reaction Details
TargetKappa-type opioid receptor
LigandBDBM50451302
Substrate/Competitorn/a
Meas. Tech.ChEMBL_146510 (CHEMBL754619)
Ki 0.037000±n/a nM
Citation Neumeyer, JLGu, XHvan Vliet, LADeNunzio, NJRusovici, DECohen, DJNegus, SSMello, NKBidlack, JM Mixed kappa agonists and mu agonists/antagonists as potential pharmacotherapeutics for cocaine abuse: synthesis and opioid receptor binding affinity of N-substituted derivatives of morphinan. Bioorg Med Chem Lett11:2735-40 (2001) Kappa-type opioid receptor
Name:Kappa-type opioid receptor
Type:G Protein-Coupled Receptor (GPCR)
Mol. Mass.:42744.99
Organism:Cavia porcellus (domestic guinea pig)
Description:P41144
Residue:380
BDBM50451302
NameBDBM50451302
Synonyms:CHEMBL2115245
TypeSmall organic molecule
Emp. Form.C19H24INO
Mol. Mass.409.3044
SMILES[H][C@@]12Cc3cc(O)ccc3[C@]3(CCCC[C@@]13[H])CCN2C\C=C\I