Reaction Details
TargetKappa-type opioid receptor
LigandBDBM50366764
Substrate/Competitorn/a
Meas. Tech.ChEMBL_146510 (CHEMBL754619)
Ki 0.003000±n/a nM
Citation Neumeyer, JLGu, XHvan Vliet, LADeNunzio, NJRusovici, DECohen, DJNegus, SSMello, NKBidlack, JM Mixed kappa agonists and mu agonists/antagonists as potential pharmacotherapeutics for cocaine abuse: synthesis and opioid receptor binding affinity of N-substituted derivatives of morphinan. Bioorg Med Chem Lett11:2735-40 (2001) Kappa-type opioid receptor
Name:Kappa-type opioid receptor
Type:G Protein-Coupled Receptor (GPCR)
Mol. Mass.:42744.99
Organism:Cavia porcellus (domestic guinea pig)
Description:P41144
Residue:380
BDBM50366764
NameBDBM50366764
Synonyms:CHEMBL1790045 | MCL-117
TypeSmall organic molecule
Emp. Form.C19H23NO
Mol. Mass.281.392
SMILESOc1ccc2C[C@@H]3[C@@H]4CCCC[C@]4(CCN3CC#C)c2c1