Reaction Details
TargetDelta-type opioid receptor
LigandBDBM50105497
Substrate/Competitorn/a
Meas. Tech.ChEBML_147151
Ki 2.6±n/a nM
Citation Neumeyer, JLGu, XHvan Vliet, LADeNunzio, NJRusovici, DECohen, DJNegus, SSMello, NKBidlack, JM Mixed kappa agonists and mu agonists/antagonists as potential pharmacotherapeutics for cocaine abuse: synthesis and opioid receptor binding affinity of N-substituted derivatives of morphinan. Bioorg Med Chem Lett11:2735-40 (2001) Delta-type opioid receptor
Name:Delta-type opioid receptor
Type:G Protein-Coupled Receptor (GPCR)
Mol. Mass.:40382.98
Organism:Homo sapiens (Human)
Description:Competition binding assays were carried out using membrane preparations from transfected HN9.10 cells that constitutively expressed the delta opioid receptor.
Residue:372
BDBM50105497
NameBDBM50105497
Synonyms:2-[5-hydroxy-(1R,9R,10R)-17-azatetracyclo[7.5.3.01,10.02,7]heptadeca-2(7),3,5-trien-17-yl]ethyl cyanide | CHEMBL93731
TypeSmall organic molecule
Emp. Form.C19H24N2O
Mol. Mass.296.4067
SMILESOc1ccc2c(C[C@@H]3[C@@H]4CCCCC24CCN3CCC#N)c1