Reaction Details
TargetReverse transcriptase/RNaseH
LigandBDBM50105593
Substrate/Competitorn/a
Meas. Tech.ChEBML_80619
IC50 96300±n/a nM
Citation Tillekeratne, LMSherette, AGrossman, PHupe, LHupe, DHudson, RA Simplified catechin-gallate inhibitors of HIV-1 reverse transcriptase. Bioorg Med Chem Lett11:2763-7 (2001) Reverse transcriptase/RNaseH
Name:Reverse transcriptase/RNaseH
Type:PROTEIN
Mol. Mass.:65229.15
Organism:Human immunodeficiency virus 1
Description:ChEMBL_1473730
Residue:566
BDBM50105593
NameBDBM50105593
Synonyms:2,4-Dihydroxy-benzoic acid 5,7-dihydroxy-chroman-3-yl ester | CHEMBL328142
TypeSmall organic molecule
Emp. Form.C16H14O7
Mol. Mass.318.2782
SMILESOc1ccc(C(=O)OC2COc3cc(O)cc(O)c3C2)c(O)c1