Reaction Details
TargetNeuromedin-K receptor
LigandBDBM50279775
Substrate/Competitorn/a
Meas. Tech.ChEBML_209563
Ki 74±n/a nM
Citation Bernstein, PRAharony, DAlbert, JSAndisik, DBarthlow, HGBialecki, RDavenport, TDedinas, RFDembofsky, BTKoether, GKosmider, BJKirkland, KOhnmacht, CJPotts, WRumsey, WLShen, LShenvi, ASherwood, SStollman, DRussell, K Discovery of novel, orally active dual NK1/NK2 antagonists. Bioorg Med Chem Lett11:2769-73 (2001) Neuromedin-K receptor
Name:Neuromedin-K receptor
Type:Enzyme
Mol. Mass.:52221.96
Organism:Homo sapiens (Human)
Description:P29371
Residue:465
BDBM50279775
NameBDBM50279775
Synonyms:(S)-3-Cyano-naphthalene-1-carboxylic acid {2-(3,4-dichloro-phenyl)-4-[4-(2-methanesulfinyl-phenyl)-piperidin-1-yl]-butyl}-methyl-amide CHEMBL129683
TypeSmall organic molecule
Emp. Form.C35H35Cl2N3O2S
Mol. Mass.632.642
SMILESCN(C[C@@H](CCN1CCC(CC1)c1ccccc1[S@](C)=O)c1ccc(Cl)c(Cl)c1)C(=O)c1cc(cc2ccccc12)C#N