Reaction Details
TargetRAF proto-oncogene serine/threonine-protein kinase
LigandBDBM50105601
Substrate/Competitorn/a
Meas. Tech.ChEBML_163037
IC50 1200±n/a nM
Citation Smith, RABarbosa, JBlum, CLBobko, MACaringal, YVDally, RJohnson, JSKatz, MEKennure, NKingery-Wood, JLee, WLowinger, TBLyons, JMarsh, VRogers, DHSwartz, SWalling, TWild, H Discovery of heterocyclic ureas as a new class of raf kinase inhibitors: identification of a second generation lead by a combinatorial chemistry approach. Bioorg Med Chem Lett11:2775-8 (2001) RAF proto-oncogene serine/threonine-protein kinase
Name:RAF proto-oncogene serine/threonine-protein kinase
Type:Serine/threonine-protein kinase
Mol. Mass.:73082.52
Organism:Homo sapiens (Human)
Description:P04049
Residue:648
BDBM50105601
NameBDBM50105601
Synonyms:5-tert-Butyl-3-[3-(5-methyl-[1,3,4]thiadiazol-2-yl)-ureido]-thiophene-2-carboxylic acid methyl ester methyl 5-tert-butyl-3-(3-(5-methyl-1,3,4-thiadiazol-2-yl)ureido)thiophene-2-carboxylate
TypeSmall organic molecule
Emp. Form.C14H18N4O3S2
Mol. Mass.354.448
SMILESCOC(=O)c1sc(cc1NC(=O)Nc1nnc(C)s1)C(C)(C)C