Reaction Details
TargetRAF proto-oncogene serine/threonine-protein kinase
LigandBDBM50105615
Substrate/Competitorn/a
Meas. Tech.ChEBML_163037
IC50 6600±n/a nM
Citation Smith, RABarbosa, JBlum, CLBobko, MACaringal, YVDally, RJohnson, JSKatz, MEKennure, NKingery-Wood, JLee, WLowinger, TBLyons, JMarsh, VRogers, DHSwartz, SWalling, TWild, H Discovery of heterocyclic ureas as a new class of raf kinase inhibitors: identification of a second generation lead by a combinatorial chemistry approach. Bioorg Med Chem Lett11:2775-8 (2001) RAF proto-oncogene serine/threonine-protein kinase
Name:RAF proto-oncogene serine/threonine-protein kinase
Type:Serine/threonine-protein kinase
Mol. Mass.:73082.52
Organism:Homo sapiens (Human)
Description:P04049
Residue:648
BDBM50105615
NameBDBM50105615
Synonyms:5-tert-Butyl-3-[3-(5-trifluoromethyl-[1,3,4]thiadiazol-2-yl)-ureido]-thiophene-2-carboxylic acid methyl ester | CHEMBL316315
TypeSmall organic molecule
Emp. Form.C14H15F3N4O3S2
Mol. Mass.408.419
SMILESCOC(=O)c1sc(cc1NC(=O)Nc1nnc(s1)C(F)(F)F)C(C)(C)C