Reaction Details
TargetRAF proto-oncogene serine/threonine-protein kinase
LigandBDBM50105619
Substrate/Competitorn/a
Meas. Tech.ChEBML_163037
IC50 540±n/a nM
Citation Smith, RABarbosa, JBlum, CLBobko, MACaringal, YVDally, RJohnson, JSKatz, MEKennure, NKingery-Wood, JLee, WLowinger, TBLyons, JMarsh, VRogers, DHSwartz, SWalling, TWild, H Discovery of heterocyclic ureas as a new class of raf kinase inhibitors: identification of a second generation lead by a combinatorial chemistry approach. Bioorg Med Chem Lett11:2775-8 (2001) RAF proto-oncogene serine/threonine-protein kinase
Name:RAF proto-oncogene serine/threonine-protein kinase
Type:Serine/threonine-protein kinase
Mol. Mass.:73082.52
Organism:Homo sapiens (Human)
Description:P04049
Residue:648
BDBM50105619
NameBDBM50105619
Synonyms:1-(5-tert-Butyl-isoxazol-3-yl)-3-(4-phenoxy-phenyl)-urea CHEMBL94487
TypeSmall organic molecule
Emp. Form.C20H21N3O3
Mol. Mass.351.399
SMILESCC(C)(C)c1cc(NC(=O)Nc2ccc(Oc3ccccc3)cc2)no1