Reaction Details
TargetReverse transcriptase/RNaseH
LigandBDBM50279762
Substrate/Competitorn/a
Meas. Tech.ChEMBL_197265 (CHEMBL804181)
EC50 5600±n/a nM
Citation Wang, DPRizzo, RCTirado-Rives, JJorgensen, WL Antiviral drug design: computational analyses of the effects of the L100I mutation for HIV-RT on the binding of NNRTIs. Bioorg Med Chem Lett11:2799-802 (2001) Reverse transcriptase/RNaseH
Name:Reverse transcriptase/RNaseH
Type:PROTEIN
Mol. Mass.:65229.15
Organism:Human immunodeficiency virus 1
Description:ChEMBL_1473730
Residue:566
BDBM50279762
NameBDBM50279762
Synonyms:(5S)-9-chloro-5-methyl-6-(3-methylbut-2-enyl)-4,5,6,7-tetrahydroimidazo[4,5,1-jk][1,4]benzodiazepine-2(1H)-thione (S)-4-Chloro-8-methyl-7-(3-methyl-but-2-enyl)-6,7,8,9-tetrahydro-2H-2,7,9a-triaza-benzo[cd]azulene-1-thione 14-(1-ethynyl)-9,15-dimethyl-(1S,9R,10R,11S,14R)-tetracyclo[8.7.0.02,7.011,15]heptadec-2(7)-en-14-ol 4-Chloro-8-methyl-7-(3-methyl-but-1-enyl)-6,7,8,9-tetrahydro-2H-2,7,9a-triaza-benzo[cd]azulene-1-thione 7-Allyl-9-chloro-8-methyl-6,7,8,9-tetrahydro-2H-2,7,9a-triaza-benzo[cd]azulen-1-one CHEMBL293498 | R-82913
TypeSmall organic molecule
Emp. Form.C16H20ClN3S
Mol. Mass.321.868
SMILESC[C@H]1Cn2c3c(CN1CC=C(C)C)cc(Cl)cc3[nH]c2=S