Reaction Details
TargetDelta-type opioid receptor
LigandBDBM50105777
Substrate/Competitorn/a
Meas. Tech.ChEBML_147336
Ki 41±n/a nM
Citation Ullrich, TDersch, CMRothman, RBJacobson, AERice, KC Derivatives of 17-(2-methylallyl)-substituted noroxymorphone: variation of the delta address and its effects on affinity and selectivity for the delta opioid receptor. Bioorg Med Chem Lett11:2883-5 (2001) Delta-type opioid receptor
Name:Delta-type opioid receptor
Type:G Protein-Coupled Receptor (GPCR)
Mol. Mass.:40382.98
Organism:Homo sapiens (Human)
Description:Competition binding assays were carried out using membrane preparations from transfected HN9.10 cells that constitutively expressed the delta opioid receptor.
Residue:372
BDBM50105777
NameBDBM50105777
Synonyms:17-(2-methylallyl)-substituted noroxymorphone derivative | CHEMBL98324
TypeSmall organic molecule
Emp. Form.C28H29NO4
Mol. Mass.443.5342
SMILESCC(=C)CN1CCC23[C@H]4Oc5c2c(CC1[C@]3(O)CC1(Cc2ccccc2C1)C4=O)ccc5O