Reaction Details
TargetDelta-type opioid receptor
LigandBDBM50105778
Substrate/Competitorn/a
Meas. Tech.ChEBML_147336
Ki 2400±n/a nM
Citation Ullrich, TDersch, CMRothman, RBJacobson, AERice, KC Derivatives of 17-(2-methylallyl)-substituted noroxymorphone: variation of the delta address and its effects on affinity and selectivity for the delta opioid receptor. Bioorg Med Chem Lett11:2883-5 (2001) Delta-type opioid receptor
Name:Delta-type opioid receptor
Type:G Protein-Coupled Receptor (GPCR)
Mol. Mass.:40382.98
Organism:Homo sapiens (Human)
Description:Competition binding assays were carried out using membrane preparations from transfected HN9.10 cells that constitutively expressed the delta opioid receptor.
Residue:372
BDBM50105778
NameBDBM50105778
Synonyms:12-methoxy-18-(2-methylallyl)-(2S,9R)-10-oxa-6,7,18-triazahexacyclo[9.9.1.01,9.02,17.04,8.015,21]henicosa-4(8),5,11,13,15(21)-pentaen-2-ol Naltrindole analogue
TypeSmall organic molecule
Emp. Form.C22H25N3O3
Mol. Mass.379.4522
SMILESCOc1ccc2CC3N(CC(C)=C)CCC45[C@@H](Oc1c24)c1[nH]ncc1C[C@@]35O