Reaction Details
TargetKappa-type opioid receptor
LigandBDBM50105775
Substrate/Competitorn/a
Meas. Tech.ChEBML_145958
Ki>14000±n/a nM
Citation Ullrich, TDersch, CMRothman, RBJacobson, AERice, KC Derivatives of 17-(2-methylallyl)-substituted noroxymorphone: variation of the delta address and its effects on affinity and selectivity for the delta opioid receptor. Bioorg Med Chem Lett11:2883-5 (2001) Kappa-type opioid receptor
Name:Kappa-type opioid receptor
Type:G Protein-Coupled Receptor (GPCR)
Mol. Mass.:42648.76
Organism:Homo sapiens (Human)
Description:P41145
Residue:380
BDBM50105775
NameBDBM50105775
Synonyms:16-methoxy-22-(2-methylallyl)-(2S,13R)-14-oxa-11,22-diazaheptacyclo[13.9.1.01,13.02,21.04,12.05,10.019,25]pentacosa-4(12),5(10),6,8,15,17,19(25)-heptaen-2-ol | CHEMBL441270
TypeSmall organic molecule
Emp. Form.C27H28N2O3
Mol. Mass.428.5228
SMILESCOc1ccc2CC3N(CC(C)=C)CCC45[C@@H](Oc1c24)c1[nH]c2ccccc2c1C[C@@]35O