Reaction Details
TargetMu-type opioid receptor
LigandBDBM50105782
Substrate/Competitorn/a
Meas. Tech.ChEBML_149316
Ki 140±n/a nM
Citation Ullrich, TDersch, CMRothman, RBJacobson, AERice, KC Derivatives of 17-(2-methylallyl)-substituted noroxymorphone: variation of the delta address and its effects on affinity and selectivity for the delta opioid receptor. Bioorg Med Chem Lett11:2883-5 (2001) Mu-type opioid receptor
Name:Mu-type opioid receptor
Type:G Protein-Coupled Receptor (GPCR)
Mol. Mass.:44789.51
Organism:Homo sapiens (Human)
Description:P35372
Residue:400
BDBM50105782
NameBDBM50105782
Synonyms:18-(2-methylallyl)-(2S,9R)-10-oxa-6,7,18-triazahexacyclo[9.9.1.01,9.02,17.04,8.015,21]henicosa-4(8),5,11,13,15(21)-pentaene-2,12-diol Naltrindole analogue
TypeSmall organic molecule
Emp. Form.C21H23N3O3
Mol. Mass.365.4256
SMILESCC(=C)CN1CCC23[C@H]4Oc5c2c(CC1[C@]3(O)Cc1cn[nH]c41)ccc5O