Reaction Details
TargetKappa-type opioid receptor
LigandBDBM50105772
Substrate/Competitorn/a
Meas. Tech.ChEBML_145958
Ki 300±n/a nM
Citation Ullrich, TDersch, CMRothman, RBJacobson, AERice, KC Derivatives of 17-(2-methylallyl)-substituted noroxymorphone: variation of the delta address and its effects on affinity and selectivity for the delta opioid receptor. Bioorg Med Chem Lett11:2883-5 (2001) Kappa-type opioid receptor
Name:Kappa-type opioid receptor
Type:G Protein-Coupled Receptor (GPCR)
Mol. Mass.:42648.76
Organism:Homo sapiens (Human)
Description:P41145
Residue:380
BDBM50105772
NameBDBM50105772
Synonyms:6-(4-chlorophenyl)-19-(2-methylallyl)-(2S,10R)-11-oxa-8,19-diazahexacyclo[10.9.1.01,10.02,18.04,9.016,22]docosa-4(9),5,7,12,14,16(22)-hexaene-2,13-diol Naltrindole analogue
TypeSmall organic molecule
Emp. Form.C29H27ClN2O3
Mol. Mass.486.989
SMILESCC(=C)CN1CCC23[C@H]4Oc5c2c(CC1[C@]3(O)Cc1cc(cnc41)-c1ccc(Cl)cc1)ccc5O