Reaction Details
TargetMatrix metalloproteinase-9
LigandBDBM50106136
Substrate/Competitorn/a
Meas. Tech.ChEBML_105530
IC50 1±n/a nM
Citation Levin, JIChen, JMDu, MTNelson, FCWehr, TDiJoseph, JFKillar, LMSkala, SSung, ASharr, MARoth, CEJin, GCowling, RDi, LSherman, MXu, ZBMarch, CJMohler, KMBlack, RASkotnicki, JS The discovery of anthranilic acid-based MMP inhibitors. Part 3: incorporation of basic amines. Bioorg Med Chem Lett11:2975-8 (2001) Matrix metalloproteinase-9
Name:Matrix metalloproteinase-9
Type:Enzyme
Mol. Mass.:78452.28
Organism:Homo sapiens (Human)
Description:P14780
Residue:707
BDBM50106136
NameBDBM50106136
Synonyms:2-{[4-(4-Chloro-phenoxy)-benzenesulfonyl]-methyl-amino}-N-hydroxy-3-(4-methyl-piperazin-1-ylmethyl)-benzamide | CHEMBL319341
TypeSmall organic molecule
Emp. Form.C26H29ClN4O5S
Mol. Mass.545.05
SMILESCN(c1c(CN2CCN(C)CC2)cccc1C(=O)NO)S(=O)(=O)c1ccc(Oc2ccc(Cl)cc2)cc1