Reaction Details
TargetInterstitial collagenase
LigandBDBM8465
Substrate/Competitorn/a
Meas. Tech.ChEMBL_106307 (CHEMBL714562)
IC50 15±n/a nM
Citation Levin, JIChen, JMDu, MTNelson, FCWehr, TDiJoseph, JFKillar, LMSkala, SSung, ASharr, MARoth, CEJin, GCowling, RDi, LSherman, MXu, ZBMarch, CJMohler, KMBlack, RASkotnicki, JS The discovery of anthranilic acid-based MMP inhibitors. Part 3: incorporation of basic amines. Bioorg Med Chem Lett11:2975-8 (2001) Interstitial collagenase
Name:Interstitial collagenase
Type:Enzyme
Mol. Mass.:54010.26
Organism:Homo sapiens (Human)
Description: P03956
Residue:469
BDBM8465
NameBDBM8465
Synonyms:(2R)-N-hydroxy-2-[(4-methoxybenzene)(pyridin-3-ylmethyl)sulfonamido]-3-methylbutanamide CGS 27023 CHEMBL514138 | hydroxamate analogue 1
TypeSmall organic molecule
Emp. Form.C18H23N3O5S
Mol. Mass.393.457
SMILESCOc1ccc(cc1)S(=O)(=O)N(Cc1cccnc1)[C@H](C(C)C)C(=O)NO